Information card for entry 1548745
Common name | nitro-nitrito-pentaammine-Co(III)-chloride-nitrate |
Formula | Cl Co H15 N7 O5 |
Calculated formula | Cl Co H15 N7 O5 |
Title of publication | Quantification of photoinduced bending of dynamic molecular crystals: from macroscopic strain to kinetic constants and activation energies. |
Authors of publication | Chizhik, Stanislav; Sidelnikov, Anatoly; Zakharov, Boris; Naumov, Panče; Boldyreva, Elena |
Journal of publication | Chemical science |
Year of publication | 2018 |
Journal volume | 9 |
Journal issue | 8 |
Pages of publication | 2319 - 2335 |
a | 14.6615 ± 0.0014 Å |
b | 7.4138 ± 0.0004 Å |
c | 9.5536 ± 0.0005 Å |
α | 90° |
β | 90° |
γ | 90° |
Cell volume | 1038.45 ± 0.13 Å3 |
Cell temperature | 295 ± 2 K |
Ambient diffraction temperature | 295 ± 2 K |
Number of distinct elements | 5 |
Space group number | 62 |
Hermann-Mauguin space group symbol | P n m a |
Hall space group symbol | -P 2ac 2n |
Residual factor for all reflections | 0.064 |
Residual factor for significantly intense reflections | 0.0463 |
Weighted residual factors for significantly intense reflections | 0.1094 |
Weighted residual factors for all reflections included in the refinement | 0.1321 |
Goodness-of-fit parameter for all reflections included in the refinement | 1.121 |
Diffraction radiation wavelength | 0.4109 Å |