Information card for entry 1548860
Formula | C42 H36.34 N O2.17 P |
Calculated formula | C42 H36.34 N O2.17 P |
Title of publication | Formation of quaternary centres by copper catalysed asymmetric conjugate addition to β-substituted cyclopentenones with the aid of a quantitative structure-selectivity relationship. |
Authors of publication | Ardkhean, Ruchuta; Mortimore, Mike; Paton, Robert S.; Fletcher, Stephen P. |
Journal of publication | Chemical science |
Year of publication | 2018 |
Journal volume | 9 |
Journal issue | 9 |
Pages of publication | 2628 - 2632 |
a | 13.9558 ± 0.0003 Å |
b | 15.4622 ± 0.0003 Å |
c | 30.6296 ± 0.0006 Å |
α | 90° |
β | 90° |
γ | 90° |
Cell volume | 6609.5 ± 0.2 Å3 |
Cell temperature | 150 K |
Ambient diffraction temperature | 150 K |
Number of distinct elements | 5 |
Space group number | 19 |
Hermann-Mauguin space group symbol | P 21 21 21 |
Hall space group symbol | P 2ac 2ab |
Residual factor for all reflections | 0.0359 |
Residual factor for significantly intense reflections | 0.0323 |
Weighted residual factors for all reflections | 0.0822 |
Weighted residual factors for significantly intense reflections | 0.0789 |
Weighted residual factors for all reflections included in the refinement | 0.0822 |
Goodness-of-fit parameter for all reflections included in the refinement | 0.9994 |
Diffraction radiation wavelength | 1.54184 Å |
Diffraction radiation type | CuKα |