Information card for entry 1548952
Formula | C12 H14 F2 O |
Calculated formula | C12 H14 F2 O |
SMILES | F[C@H]1[C@H](C[C@H](O)C[C@H]1F)c1ccccc1.F[C@@H]1[C@@H](C[C@@H](O)C[C@@H]1F)c1ccccc1 |
Title of publication | Metabolism and hydrophilicity of the polarised 'Janus face' all-<i>cis</i> tetrafluorocyclohexyl ring, a candidate motif for drug discovery. |
Authors of publication | Rodil, Andrea; Bosisio, Stefano; Ayoup, Mohammed Salah; Quinn, Laura; Cordes, David B.; Slawin, Alexandra M. Z.; Murphy, Cormac D.; Michel, Julien; O'Hagan, David |
Journal of publication | Chemical science |
Year of publication | 2018 |
Journal volume | 9 |
Journal issue | 11 |
Pages of publication | 3023 - 3028 |
a | 10.536 ± 0.003 Å |
b | 19.983 ± 0.006 Å |
c | 10.272 ± 0.003 Å |
α | 90° |
β | 107.972 ± 0.007° |
γ | 90° |
Cell volume | 2057.2 ± 1 Å3 |
Cell temperature | 173 K |
Ambient diffraction temperature | 173 K |
Number of distinct elements | 4 |
Space group number | 14 |
Hermann-Mauguin space group symbol | P 1 21/c 1 |
Hall space group symbol | -P 2ybc |
Residual factor for all reflections | 0.0389 |
Residual factor for significantly intense reflections | 0.0359 |
Weighted residual factors for significantly intense reflections | 0.1055 |
Weighted residual factors for all reflections included in the refinement | 0.1078 |
Goodness-of-fit parameter for all reflections included in the refinement | 1.032 |
Diffraction radiation wavelength | 1.54187 Å |
Diffraction radiation type | CuKα |