Information card for entry 1549022
Formula | C27 H18 N2 O3 S |
Calculated formula | C27 H18 N2 O3 S |
SMILES | S(=O)(=O)(c1ccccc1)/C=C/1NC(=O)c2c1cc(n1c3c(c4c1cccc4)cccc3)cc2 |
Title of publication | Developing the structure-property relationship to design solid state multi-stimuli responsive materials and their potential applications in different fields. |
Authors of publication | Roy, Bibhisan; Reddy, Mallu Chenna; Hazra, Partha |
Journal of publication | Chemical science |
Year of publication | 2018 |
Journal volume | 9 |
Journal issue | 14 |
Pages of publication | 3592 - 3606 |
a | 25.719 ± 0.007 Å |
b | 7.5368 ± 0.0018 Å |
c | 11.759 ± 0.003 Å |
α | 90° |
β | 116.39 ± 0.01° |
γ | 90° |
Cell volume | 2041.8 ± 0.9 Å3 |
Cell temperature | 296 ± 2 K |
Ambient diffraction temperature | 296 ± 2 K |
Number of distinct elements | 5 |
Space group number | 5 |
Hermann-Mauguin space group symbol | C 1 2 1 |
Hall space group symbol | C 2y |
Residual factor for all reflections | 0.1027 |
Residual factor for significantly intense reflections | 0.0521 |
Weighted residual factors for significantly intense reflections | 0.1205 |
Weighted residual factors for all reflections included in the refinement | 0.1454 |
Goodness-of-fit parameter for all reflections included in the refinement | 0.887 |
Diffraction radiation wavelength | 0.71073 Å |
Diffraction radiation type | MoKα |