Information card for entry 1549320
Chemical name | (1,9-dibutyl-2,5,8,10,13,16,17,20,23-nonaoxabicyclo[7.7.7]tricosane)-sodium tetrakis(3,5-bis(trifluoromethyl)phenyl)borate |
Formula | C54 H54 B F24 Na O9 |
Calculated formula | C54 H54 B F24 Na O9 |
SMILES | FC(F)(F)c1cc(cc(c1)[B-](c1cc(cc(c1)C(F)(F)F)C(F)(F)F)(c1cc(cc(c1)C(F)(F)F)C(F)(F)F)c1cc(cc(c1)C(F)(F)F)C(F)(F)F)C(F)(F)F.[Na]12345678[O]9CC[O]1CC[O]2C1([O]3CC[O]4CC[O]5C9([O]6CC[O]7CC[O]81)CCCC)CCCC |
Title of publication | Self-assembled orthoester cryptands: orthoester scope, post-functionalization, kinetic locking and tunable degradation kinetics. |
Authors of publication | Löw, Henrik; Mena-Osteritz, Elena; von Delius, Max |
Journal of publication | Chemical science |
Year of publication | 2018 |
Journal volume | 9 |
Journal issue | 21 |
Pages of publication | 4785 - 4793 |
a | 12.434 ± 0.004 Å |
b | 12.984 ± 0.005 Å |
c | 20.025 ± 0.007 Å |
α | 93.798 ± 0.013° |
β | 107.54 ± 0.012° |
γ | 104.457 ± 0.008° |
Cell volume | 2949.7 ± 1.8 Å3 |
Cell temperature | 293 ± 2 K |
Ambient diffraction temperature | 293.15 K |
Number of distinct elements | 6 |
Space group number | 2 |
Hermann-Mauguin space group symbol | P -1 |
Hall space group symbol | -P 1 |
Residual factor for all reflections | 0.061 |
Residual factor for significantly intense reflections | 0.0492 |
Weighted residual factors for significantly intense reflections | 0.1186 |
Weighted residual factors for all reflections included in the refinement | 0.1261 |
Goodness-of-fit parameter for all reflections included in the refinement | 1.045 |
Diffraction radiation wavelength | 0.71073 Å |
Diffraction radiation type | MoKα |