Information card for entry 1549322
Formula | C36 H24 Cl4 N2 O8 |
Calculated formula | C36 H24 Cl4 N2 O8 |
SMILES | Clc1c(/C=C/c2cc[nH+]cc2)ccc(Cl)c1.Clc1c(/C=C/c2cc[nH+]cc2)ccc(Cl)c1.OC(=O)c1c(C(=O)[O-])cc(C(=O)O)c(C(=O)[O-])c1 |
Title of publication | 1,2,4,5-Benzenetetracarboxylic acid: a versatile hydrogen bonding template for controlling the regioselective topochemical synthesis of head-to-tail photodimers from stilbazole derivatives. |
Authors of publication | Ortega, Gabriela; Hernández, Jesús; González, Teresa; Dorta, Romano; Briceño, Alexander |
Journal of publication | Photochemical & photobiological sciences : Official journal of the European Photochemistry Association and the European Society for Photobiology |
Year of publication | 2018 |
Journal volume | 17 |
Journal issue | 5 |
Pages of publication | 670 - 680 |
a | 7.5046 ± 0.0015 Å |
b | 9.6822 ± 0.0019 Å |
c | 12.452 ± 0.003 Å |
α | 69.07 ± 0.03° |
β | 79.63 ± 0.03° |
γ | 77.91 ± 0.03° |
Cell volume | 820.8 ± 0.4 Å3 |
Cell temperature | 293 ± 2 K |
Ambient diffraction temperature | 295 ± 2 K |
Number of distinct elements | 5 |
Space group number | 2 |
Hermann-Mauguin space group symbol | P -1 |
Hall space group symbol | -P 1 |
Residual factor for all reflections | 0.0585 |
Residual factor for significantly intense reflections | 0.0474 |
Weighted residual factors for significantly intense reflections | 0.1195 |
Weighted residual factors for all reflections included in the refinement | 0.127 |
Goodness-of-fit parameter for all reflections included in the refinement | 1.084 |
Diffraction radiation wavelength | 0.71073 Å |
Diffraction radiation type | MoKα |