Information card for entry 1549415
Formula | C8 H8 B F4 N |
Calculated formula | C8 H8 B F4 N |
Title of publication | Facile synthesis of α-aminoboronic acids from amines and potassium acyltrifluoroborates (KATs) <i>via</i> trifluoroborate-iminiums (TIMs). |
Authors of publication | Shiro, Tomoya; Schuhmacher, Anne; Jackl, Moritz K.; Bode, Jeffrey W. |
Journal of publication | Chemical science |
Year of publication | 2018 |
Journal volume | 9 |
Journal issue | 23 |
Pages of publication | 5191 - 5196 |
a | 6.1042 ± 0.0002 Å |
b | 37.0556 ± 0.001 Å |
c | 7.9394 ± 0.0002 Å |
α | 90° |
β | 93.529 ± 0.003° |
γ | 90° |
Cell volume | 1792.45 ± 0.09 Å3 |
Cell temperature | 100 ± 0.1 K |
Ambient diffraction temperature | 100 ± 0.1 K |
Number of distinct elements | 5 |
Space group number | 14 |
Hermann-Mauguin space group symbol | P 1 21/c 1 |
Hall space group symbol | -P 2ybc |
Residual factor for all reflections | 0.0692 |
Residual factor for significantly intense reflections | 0.0653 |
Weighted residual factors for significantly intense reflections | 0.1939 |
Weighted residual factors for all reflections included in the refinement | 0.198 |
Goodness-of-fit parameter for all reflections included in the refinement | 1.094 |
Diffraction radiation probe | x-ray |
Diffraction radiation wavelength | 1.54184 Å |
Diffraction radiation type | CuKα |