Information card for entry 1550397
Chemical name | Lithium Cobalt Oxide |
Formula | Co Li O2 |
Calculated formula | Co Li O2 |
Title of publication | Structural Assessment of the Electrochemical Performance of LixCoO2 Membrane Electrodes by X-Ray Diffraction and Absorpion Refinements |
Authors of publication | Rosolen JM; Ballirano P; Berrettoni M; Decker F; Gregorkiewitz M |
Journal of publication | Ionics |
Year of publication | 1997 |
Journal volume | 3 |
Pages of publication | 345 - 354 |
a | 2.8185 ± 0.0001 Å |
b | 2.8185 ± 0.0001 Å |
c | 14.0664 ± 0.0002 Å |
α | 90° |
β | 90° |
γ | 120° |
Cell volume | 96.772 ± 0.005 Å3 |
Number of distinct elements | 3 |
Space group number | 166 |
Hermann-Mauguin space group symbol | R -3 m :H |
Hall space group symbol | -R 3 2" |
Residual factor R(I) for significantly intense reflections | 0.039 |
Goodness-of-fit parameter for all reflections | 1.04 |
Method of determination | powder diffraction |
Diffraction radiation wavelength | 1.5406 Å |
Diffraction radiation type | CuKα |