Information card for entry 1552760
Formula | C148 H194 Ag44 O84 S38 V10 |
Calculated formula | C148 H194 Ag44 O84 S38 V10 |
Title of publication | Enclosing classical polyoxometallates in silver nanoclusters. |
Authors of publication | Wang, Zhi; Sun, Yi-Ming; Qu, Qing-Ping; Liang, Yu-Xin; Wang, Xing-Po; Liu, Qing-Yun; Kurmoo, Mohamedally; Su, Hai-Feng; Tung, Chen-Ho; Sun, Di |
Journal of publication | Nanoscale |
Year of publication | 2019 |
Journal volume | 11 |
Journal issue | 22 |
Pages of publication | 10927 - 10931 |
a | 19.9658 ± 0.0006 Å |
b | 20.2722 ± 0.0014 Å |
c | 20.4027 ± 0.0012 Å |
α | 60.809 ± 0.007° |
β | 70.785 ± 0.004° |
γ | 78.996 ± 0.004° |
Cell volume | 6803 ± 0.8 Å3 |
Cell temperature | 100 ± 0.1 K |
Ambient diffraction temperature | 100 ± 0.1 K |
Number of distinct elements | 6 |
Space group number | 2 |
Hermann-Mauguin space group symbol | P -1 |
Hall space group symbol | -P 1 |
Residual factor for all reflections | 0.1256 |
Residual factor for significantly intense reflections | 0.0858 |
Weighted residual factors for significantly intense reflections | 0.2125 |
Weighted residual factors for all reflections included in the refinement | 0.2387 |
Goodness-of-fit parameter for all reflections included in the refinement | 1.024 |
Diffraction radiation probe | x-ray |
Diffraction radiation wavelength | 0.71073 Å |
Diffraction radiation type | MoKα |