Information card for entry 1554991
Formula | C13 H11 N O3 |
Calculated formula | C13 H11 N O3 |
SMILES | N1(c2ccccc2C2(OC(=CC2=O)C)C1=O)C |
Title of publication | Phosphine-catalyzed fixation of CO2 with γ-hydroxyl alkynone under ambient temperature and pressure: kinetic resolution and further conversion |
Authors of publication | Sun, Yao-Liang; Wei, Yin; Shi, Min |
Journal of publication | Organic Chemistry Frontiers |
Year of publication | 2019 |
Journal volume | 6 |
Journal issue | 14 |
Pages of publication | 2420 |
a | 9.4606 ± 0.0016 Å |
b | 8.7844 ± 0.0015 Å |
c | 13.698 ± 0.002 Å |
α | 90° |
β | 91.45 ± 0.004° |
γ | 90° |
Cell volume | 1138 ± 0.3 Å3 |
Cell temperature | 293 ± 2 K |
Ambient diffraction temperature | 293 ± 2 K |
Number of distinct elements | 4 |
Space group number | 14 |
Hermann-Mauguin space group symbol | P 1 21/c 1 |
Hall space group symbol | -P 2ybc |
Residual factor for all reflections | 0.0639 |
Residual factor for significantly intense reflections | 0.0434 |
Weighted residual factors for significantly intense reflections | 0.1065 |
Weighted residual factors for all reflections included in the refinement | 0.1177 |
Goodness-of-fit parameter for all reflections included in the refinement | 1.031 |
Diffraction radiation wavelength | 0.71073 Å |
Diffraction radiation type | MoKα |