Information card for entry 1557248
Formula | C97 H126 Mn3 N12 O18 |
Calculated formula | C83 H86 Mn3 N12 O14 |
Title of publication | MOF matrix isolation: cooperative conformational mobility enables reliable single crystal transformations. |
Authors of publication | Peralta, Ricardo A.; Huxley, Michael T.; Young, Rosemary J.; Linder-Patton, Oliver M; Evans, Jack D.; Doonan, Christian J.; Sumby, Christopher J. |
Journal of publication | Faraday discussions |
Year of publication | 2021 |
Journal volume | 225 |
Journal issue | 0 |
Pages of publication | 84 - 99 |
a | 12.364 ± 0.003 Å |
b | 12.947 ± 0.003 Å |
c | 30.366 ± 0.006 Å |
α | 99.4 ± 0.03° |
β | 97.35 ± 0.03° |
γ | 91.57 ± 0.03° |
Cell volume | 4750.4 ± 1.9 Å3 |
Cell temperature | 100 ± 2 K |
Ambient diffraction temperature | 100.15 K |
Number of distinct elements | 5 |
Space group number | 2 |
Hermann-Mauguin space group symbol | P -1 |
Hall space group symbol | -P 1 |
Residual factor for all reflections | 0.25 |
Residual factor for significantly intense reflections | 0.2135 |
Weighted residual factors for significantly intense reflections | 0.5779 |
Weighted residual factors for all reflections included in the refinement | 0.5982 |
Goodness-of-fit parameter for all reflections included in the refinement | 2.437 |
Diffraction radiation wavelength | 0.7107 Å |
Diffraction radiation type | Synchrotron |