Information card for entry 1560242
Formula | C41.79 H50.79 Cl0.41 N0.79 P2 |
Calculated formula | C41.794 H50.794 Cl0.412 N0.794 P2 |
Title of publication | Towards the rational design of ylide-substituted phosphines for gold(i)-catalysis: from inactive to ppm-level catalysis |
Authors of publication | Handelmann, Jens; Babu, Chatla Naga; Steinert, Henning; Schwarz, Christopher; Scherpf, Thorsten; Kroll, Alexander; Gessner, Viktoria H. |
Journal of publication | Chemical Science |
Year of publication | 2021 |
Journal volume | 12 |
Journal issue | 12 |
Pages of publication | 4329 - 4337 |
a | 10.9245 ± 0.0002 Å |
b | 12.9655 ± 0.0003 Å |
c | 14.1731 ± 0.0002 Å |
α | 63.574 ± 0.002° |
β | 81.1475 ± 0.0015° |
γ | 75.1466 ± 0.0018° |
Cell volume | 1735.83 ± 0.07 Å3 |
Cell temperature | 100 ± 2 K |
Ambient diffraction temperature | 100 ± 2 K |
Number of distinct elements | 5 |
Space group number | 2 |
Hermann-Mauguin space group symbol | P -1 |
Hall space group symbol | -P 1 |
Residual factor for all reflections | 0.035 |
Residual factor for significantly intense reflections | 0.0334 |
Weighted residual factors for significantly intense reflections | 0.087 |
Weighted residual factors for all reflections included in the refinement | 0.088 |
Goodness-of-fit parameter for all reflections included in the refinement | 1.043 |
Diffraction radiation wavelength | 1.54184 Å |
Diffraction radiation type | CuKα |