Information card for entry 1560244
Formula | C41 H50 Au Cl O P2 |
Calculated formula | C41 H50 Au Cl O P2 |
Title of publication | Towards the rational design of ylide-substituted phosphines for gold(i)-catalysis: from inactive to ppm-level catalysis |
Authors of publication | Handelmann, Jens; Babu, Chatla Naga; Steinert, Henning; Schwarz, Christopher; Scherpf, Thorsten; Kroll, Alexander; Gessner, Viktoria H. |
Journal of publication | Chemical Science |
Year of publication | 2021 |
Journal volume | 12 |
Journal issue | 12 |
Pages of publication | 4329 - 4337 |
a | 9.3045 ± 0.0004 Å |
b | 10.502 ± 0.0004 Å |
c | 18.6397 ± 0.0006 Å |
α | 97.739 ± 0.003° |
β | 91.819 ± 0.003° |
γ | 94.738 ± 0.003° |
Cell volume | 1796.94 ± 0.12 Å3 |
Cell temperature | 100 ± 2 K |
Ambient diffraction temperature | 100 ± 2 K |
Number of distinct elements | 6 |
Space group number | 2 |
Hermann-Mauguin space group symbol | P -1 |
Hall space group symbol | -P 1 |
Residual factor for all reflections | 0.0483 |
Residual factor for significantly intense reflections | 0.0466 |
Weighted residual factors for significantly intense reflections | 0.1291 |
Weighted residual factors for all reflections included in the refinement | 0.1332 |
Goodness-of-fit parameter for all reflections included in the refinement | 1.081 |
Diffraction radiation wavelength | 1.54184 Å |
Diffraction radiation type | CuKα |