Information card for entry 1560247
Formula | C40 H48 Au Cl P2 |
Calculated formula | C40 H48 Au Cl P2 |
SMILES | [Au](Cl)[P](C(=P(c1ccccc1)(c1ccccc1)c1ccccc1)c1c(cc(cc1C)C)C)(C1CCCCC1)C1CCCCC1 |
Title of publication | Towards the rational design of ylide-substituted phosphines for gold(i)-catalysis: from inactive to ppm-level catalysis |
Authors of publication | Handelmann, Jens; Babu, Chatla Naga; Steinert, Henning; Schwarz, Christopher; Scherpf, Thorsten; Kroll, Alexander; Gessner, Viktoria H. |
Journal of publication | Chemical Science |
Year of publication | 2021 |
Journal volume | 12 |
Journal issue | 12 |
Pages of publication | 4329 - 4337 |
a | 12.0432 ± 0.0002 Å |
b | 16.7764 ± 0.0002 Å |
c | 17.8978 ± 0.0002 Å |
α | 90° |
β | 106.65 ± 0.001° |
γ | 90° |
Cell volume | 3464.49 ± 0.08 Å3 |
Cell temperature | 100 ± 0.1 K |
Ambient diffraction temperature | 100 ± 0.1 K |
Number of distinct elements | 5 |
Space group number | 14 |
Hermann-Mauguin space group symbol | P 1 21/n 1 |
Hall space group symbol | -P 2yn |
Residual factor for all reflections | 0.0197 |
Residual factor for significantly intense reflections | 0.0189 |
Weighted residual factors for significantly intense reflections | 0.049 |
Weighted residual factors for all reflections included in the refinement | 0.0494 |
Goodness-of-fit parameter for all reflections included in the refinement | 1.06 |
Diffraction radiation probe | x-ray |
Diffraction radiation wavelength | 1.54184 Å |
Diffraction radiation type | CuKα |