Information card for entry 1560250
Formula | C44 H50 P2 |
Calculated formula | C44 H50 P2 |
Title of publication | Towards the rational design of ylide-substituted phosphines for gold(i)-catalysis: from inactive to ppm-level catalysis |
Authors of publication | Handelmann, Jens; Babu, Chatla Naga; Steinert, Henning; Schwarz, Christopher; Scherpf, Thorsten; Kroll, Alexander; Gessner, Viktoria H. |
Journal of publication | Chemical Science |
Year of publication | 2021 |
Journal volume | 12 |
Journal issue | 12 |
Pages of publication | 4329 - 4337 |
a | 9.3576 ± 0.0005 Å |
b | 13.3096 ± 0.0006 Å |
c | 14.9346 ± 0.0008 Å |
α | 93.442 ± 0.004° |
β | 93.343 ± 0.004° |
γ | 107.914 ± 0.004° |
Cell volume | 1760.89 ± 0.16 Å3 |
Cell temperature | 100 ± 2 K |
Ambient diffraction temperature | 100 ± 2 K |
Number of distinct elements | 3 |
Space group number | 2 |
Hermann-Mauguin space group symbol | P -1 |
Hall space group symbol | -P 1 |
Residual factor for all reflections | 0.0503 |
Residual factor for significantly intense reflections | 0.0389 |
Weighted residual factors for significantly intense reflections | 0.0917 |
Weighted residual factors for all reflections included in the refinement | 0.0998 |
Goodness-of-fit parameter for all reflections included in the refinement | 1.023 |
Diffraction radiation wavelength | 1.54184 Å |
Diffraction radiation type | CuKα |