Information card for entry 1560279
Formula | C17.24 H19.73 N3 O4.75 |
Calculated formula | C17.244 H19.734 N3 O4.754 |
Title of publication | Rapid synthesis of pomalidomide-conjugates for the development of protein degrader libraries |
Authors of publication | Brownsey, Duncan K.; Rowley, Ben C.; Gorobets, Evgueni; Gelfand, Benjamin S.; Derksen, Darren J. |
Journal of publication | Chemical Science |
Year of publication | 2021 |
Journal volume | 12 |
Journal issue | 12 |
Pages of publication | 4519 - 4525 |
a | 7.2814 ± 0.0002 Å |
b | 10.1224 ± 0.0002 Å |
c | 12.178 ± 0.0003 Å |
α | 92.523 ± 0.002° |
β | 106.963 ± 0.002° |
γ | 100.062 ± 0.002° |
Cell volume | 841.02 ± 0.04 Å3 |
Cell temperature | 173 ± 2 K |
Ambient diffraction temperature | 173 K |
Number of distinct elements | 4 |
Space group number | 2 |
Hermann-Mauguin space group symbol | P -1 |
Hall space group symbol | -P 1 |
Residual factor for all reflections | 0.049 |
Residual factor for significantly intense reflections | 0.0482 |
Weighted residual factors for significantly intense reflections | 0.1237 |
Weighted residual factors for all reflections included in the refinement | 0.1247 |
Goodness-of-fit parameter for all reflections included in the refinement | 1.068 |
Diffraction radiation wavelength | 1.54178 Å |
Diffraction radiation type | CuKα |