Information card for entry 1560309
Common name | RM436 |
Formula | C12 H8 N2 O |
Calculated formula | C12 H8 N2 O |
SMILES | O=C1c2c3n(cccc3)c(c2CC1)C#N |
Title of publication | Electrophilic reactivities of cyclic enones and α,β-unsaturated lactones |
Authors of publication | Mayer, Robert J.; Allihn, Patrick W. A.; Hampel, Nathalie; Mayer, Peter; Sieber, Stephan A.; Ofial, Armin R. |
Journal of publication | Chemical Science |
Year of publication | 2021 |
Journal volume | 12 |
Journal issue | 13 |
Pages of publication | 4850 - 4865 |
a | 14.2681 ± 0.0007 Å |
b | 3.9182 ± 0.0002 Å |
c | 17.1782 ± 0.001 Å |
α | 90° |
β | 109.954 ± 0.002° |
γ | 90° |
Cell volume | 902.7 ± 0.08 Å3 |
Cell temperature | 108 ± 2 K |
Ambient diffraction temperature | 108 ± 2 K |
Number of distinct elements | 4 |
Space group number | 14 |
Hermann-Mauguin space group symbol | P 1 21/c 1 |
Hall space group symbol | -P 2ybc |
Residual factor for all reflections | 0.0598 |
Residual factor for significantly intense reflections | 0.046 |
Weighted residual factors for significantly intense reflections | 0.1064 |
Weighted residual factors for all reflections included in the refinement | 0.1119 |
Goodness-of-fit parameter for all reflections included in the refinement | 1.089 |
Diffraction radiation wavelength | 0.71073 Å |
Diffraction radiation type | MoKα |