Information card for entry 1560311
Common name | RNH389f2 |
Formula | C13 H11 N O |
Calculated formula | C13 H11 N O |
Title of publication | Electrophilic reactivities of cyclic enones and α,β-unsaturated lactones |
Authors of publication | Mayer, Robert J.; Allihn, Patrick W. A.; Hampel, Nathalie; Mayer, Peter; Sieber, Stephan A.; Ofial, Armin R. |
Journal of publication | Chemical Science |
Year of publication | 2021 |
Journal volume | 12 |
Journal issue | 13 |
Pages of publication | 4850 - 4865 |
a | 10.8844 ± 0.0009 Å |
b | 9.9707 ± 0.0007 Å |
c | 9.168 ± 0.0007 Å |
α | 90° |
β | 91.835 ± 0.003° |
γ | 90° |
Cell volume | 994.45 ± 0.13 Å3 |
Cell temperature | 102 ± 2 K |
Ambient diffraction temperature | 102 ± 2 K |
Number of distinct elements | 4 |
Space group number | 14 |
Hermann-Mauguin space group symbol | P 1 21/c 1 |
Hall space group symbol | -P 2ybc |
Residual factor for all reflections | 0.0529 |
Residual factor for significantly intense reflections | 0.0415 |
Weighted residual factors for significantly intense reflections | 0.1046 |
Weighted residual factors for all reflections included in the refinement | 0.1163 |
Goodness-of-fit parameter for all reflections included in the refinement | 1.043 |
Diffraction radiation wavelength | 0.71073 Å |
Diffraction radiation type | MoKα |