Information card for entry 1560434
Common name | barium boron aluminum silicon nitride |
Formula | Al4 B2 Ba5 N52 Si32 |
Calculated formula | Al3.9996 B2 Ba5 N52 Si32.0012 |
Title of publication | Synthesis and crystal structure of a new aluminum-silicon-nitride phosphor containing boron, Ba 5 B 2 Al 4 Si 32 N 52 :Eu |
Authors of publication | Yoshimura, Fumitaka; Yamane, Hisanori; Nagasako, Makoto |
Journal of publication | Journal of Solid State Chemistry |
Year of publication | 2017 |
Journal volume | 251 |
Pages of publication | 43 - 49 |
a | 9.7879 ± 0.0011 Å |
b | 9.792 ± 0.0011 Å |
c | 12.7226 ± 0.0015 Å |
α | 96.074 ± 0.004° |
β | 112.33 ± 0.003° |
γ | 94.08 ± 0.004° |
Cell volume | 1113.4 ± 0.2 Å3 |
Cell temperature | 303 ± 2 K |
Ambient diffraction temperature | 303 ± 2 K |
Number of distinct elements | 5 |
Space group number | 1 |
Hermann-Mauguin space group symbol | P 1 |
Hall space group symbol | P 1 |
Residual factor for all reflections | 0.0591 |
Residual factor for significantly intense reflections | 0.0584 |
Weighted residual factors for significantly intense reflections | 0.1561 |
Weighted residual factors for all reflections included in the refinement | 0.1568 |
Goodness-of-fit parameter for all reflections included in the refinement | 1.069 |
Diffraction radiation wavelength | 0.71073 Å |
Diffraction radiation type | MoKα |