Information card for entry 1560535
Formula | C24 H54 B20 |
Calculated formula | C24 H54 B20 |
SMILES | [C]12345[C]678([C@H]([C@@H]9[C@H](C1(C)C)[C@H]1C([C]%10%11%12%13[C]%14%15%16([C@H]([C@@H]91)C(C)(C)C)[BH]19%10[BH]%10%17%11[BH]%11%18%12[BH]%12%13%14[BH]%13%14%18[BH]%18%17%11[BH]%119%10[BH]9%151[BH]%16%12%13[BH]%14%18%119)(C)C)C(C)(C)C)[BH]192[BH]2%103[BH]3%114[BH]456[BH]56%11[BH]%11%103[BH]392[BH]271[BH]845[BH]6%1132.[C]12345[C]678([C@@H]([C@H]9[C@@H](C1(C)C)[C@@H]1C([C]%10%11%12%13[C]%14%15%16([C@@H]([C@H]91)C(C)(C)C)[BH]19%10[BH]%10%17%11[BH]%11%18%12[BH]%12%13%14[BH]%13%14%18[BH]%18%17%11[BH]%119%10[BH]9%151[BH]%16%12%13[BH]%14%18%119)(C)C)C(C)(C)C)[BH]192[BH]2%103[BH]3%114[BH]456[BH]56%11[BH]%11%103[BH]392[BH]271[BH]845[BH]6%1132 |
Title of publication | Tandem [4 + 2]/[2 + 2] cycloaddition of o-carboryne with enynes: facile construction of carborane-fused tricyclics |
Authors of publication | Zhang, Jie; Xie, Zuowei |
Journal of publication | Chemical Science |
Year of publication | 2021 |
Journal volume | 12 |
Journal issue | 15 |
Pages of publication | 5616 - 5620 |
a | 13.2519 ± 0.0006 Å |
b | 11.98 ± 0.0005 Å |
c | 21.8685 ± 0.001 Å |
α | 90° |
β | 105.683 ± 0.0014° |
γ | 90° |
Cell volume | 3342.5 ± 0.3 Å3 |
Cell temperature | 296 ± 2 K |
Ambient diffraction temperature | 296 ± 2 K |
Number of distinct elements | 3 |
Space group number | 14 |
Hermann-Mauguin space group symbol | P 1 21/n 1 |
Hall space group symbol | -P 2yn |
Residual factor for all reflections | 0.0877 |
Residual factor for significantly intense reflections | 0.0582 |
Weighted residual factors for significantly intense reflections | 0.1492 |
Weighted residual factors for all reflections included in the refinement | 0.1737 |
Goodness-of-fit parameter for all reflections included in the refinement | 1.037 |
Diffraction radiation wavelength | 0.71073 Å |
Diffraction radiation type | MoKα |