Information card for entry 1560750
Formula | C54 H49 O P4 S4 Y |
Calculated formula | C54 H49 O P4 S4 Y |
SMILES | [Y]1234([S]=P(C3=P(S1)(c1ccccc1)c1ccccc1)(c1ccccc1)c1ccccc1)([S]=P(C4P(=[S]2)(c1ccccc1)c1ccccc1)(c1ccccc1)c1ccccc1)[O]1CCCC1 |
Title of publication | Correlating axial and equatorial ligand field effects to the single-molecule magnet performances of a family of dysprosium bis-methanediide complexes |
Authors of publication | Thomas-Hargreaves, Lewis R.; Giansiracusa, Marcus J.; Gregson, Matthew; Zanda, Emanuele; O'Donnell, Felix; Wooles, Ashley J.; Chilton, Nicholas F.; Liddle, Stephen T. |
Journal of publication | Chemical Science |
Year of publication | 2021 |
Journal volume | 12 |
Journal issue | 11 |
Pages of publication | 3911 - 3920 |
a | 10.8536 ± 0.0006 Å |
b | 22.5853 ± 0.001 Å |
c | 21.0093 ± 0.0011 Å |
α | 90° |
β | 99.013 ± 0.006° |
γ | 90° |
Cell volume | 5086.5 ± 0.5 Å3 |
Cell temperature | 150 ± 2 K |
Ambient diffraction temperature | 150 ± 2 K |
Number of distinct elements | 6 |
Space group number | 14 |
Hermann-Mauguin space group symbol | P 1 21/n 1 |
Hall space group symbol | -P 2yn |
Residual factor for all reflections | 0.1213 |
Residual factor for significantly intense reflections | 0.0705 |
Weighted residual factors for significantly intense reflections | 0.0968 |
Weighted residual factors for all reflections included in the refinement | 0.1114 |
Goodness-of-fit parameter for all reflections included in the refinement | 1.032 |
Diffraction radiation probe | x-ray |
Diffraction radiation wavelength | 0.71073 Å |
Diffraction radiation type | MoKα |