Information card for entry 1560753
Formula | C116 H120 K2 O8 P8 S8 Y2 |
Calculated formula | C116 H120 K2 O8 P8 S8 Y2 |
SMILES | [Y]1234([S]=P(C3=P(S1)(c1ccccc1)c1ccccc1)(c1ccccc1)c1ccccc1)[S]=P(C4=P(S2)(c1ccccc1)c1ccccc1)(c1ccccc1)c1ccccc1.[Y]12345[S]6[K]78([S]2P(=C5P(=[S]3[K]23([S]1=P(C4=P6(c1ccccc1)c1ccccc1)(c1ccccc1)c1ccccc1)([O](C)CC[O]2C)[O](C)CC[O]3C)(c1ccccc1)c1ccccc1)(c1ccccc1)c1ccccc1)([O](C)CC[O]7C)[O](C)CC[O]8C |
Title of publication | Correlating axial and equatorial ligand field effects to the single-molecule magnet performances of a family of dysprosium bis-methanediide complexes |
Authors of publication | Thomas-Hargreaves, Lewis R.; Giansiracusa, Marcus J.; Gregson, Matthew; Zanda, Emanuele; O'Donnell, Felix; Wooles, Ashley J.; Chilton, Nicholas F.; Liddle, Stephen T. |
Journal of publication | Chemical Science |
Year of publication | 2021 |
Journal volume | 12 |
Journal issue | 11 |
Pages of publication | 3911 - 3920 |
a | 13.4728 ± 0.0004 Å |
b | 20.8633 ± 0.0005 Å |
c | 22.1735 ± 0.0004 Å |
α | 71.523 ± 0.002° |
β | 79.315 ± 0.002° |
γ | 84.386 ± 0.002° |
Cell volume | 5803.8 ± 0.3 Å3 |
Cell temperature | 100 ± 2 K |
Ambient diffraction temperature | 100 ± 2 K |
Number of distinct elements | 7 |
Space group number | 2 |
Hermann-Mauguin space group symbol | P -1 |
Hall space group symbol | -P 1 |
Residual factor for all reflections | 0.1035 |
Residual factor for significantly intense reflections | 0.0682 |
Weighted residual factors for significantly intense reflections | 0.1374 |
Weighted residual factors for all reflections included in the refinement | 0.1486 |
Goodness-of-fit parameter for all reflections included in the refinement | 1.064 |
Diffraction radiation probe | x-ray |
Diffraction radiation wavelength | 0.71073 Å |
Diffraction radiation type | MoKα |