Information card for entry 1560984
Formula | C119 H109.1 N12 O23 |
Calculated formula | C119 H109.1 N12 O23 |
Title of publication | Porous shape-persistent rylene imine cages with tunable optoelectronic properties and delayed fluorescence |
Authors of publication | Huang, Hsin-Hua; Song, Kyung Seob; Prescimone, Alessandro; Aster, Alexander; Cohen, Gabriel; Mannancherry, Rajesh; Vauthey, Eric; Coskun, Ali; Šolomek, Tomáš |
Journal of publication | Chemical Science |
Year of publication | 2021 |
Journal volume | 12 |
Journal issue | 14 |
Pages of publication | 5275 - 5285 |
a | 31.9058 ± 0.0006 Å |
b | 17.2344 ± 0.0003 Å |
c | 20.9913 ± 0.0004 Å |
α | 90° |
β | 102.315 ± 0.001° |
γ | 90° |
Cell volume | 11277 ± 0.4 Å3 |
Cell temperature | 130 K |
Ambient diffraction temperature | 130 K |
Number of distinct elements | 4 |
Space group number | 5 |
Hermann-Mauguin space group symbol | C 1 2 1 |
Hall space group symbol | C 2y |
Residual factor for all reflections | 0.0984 |
Residual factor for significantly intense reflections | 0.0879 |
Weighted residual factors for significantly intense reflections | 0.2449 |
Weighted residual factors for all reflections included in the refinement | 0.2617 |
Goodness-of-fit parameter for all reflections included in the refinement | 1.083 |
Diffraction radiation probe | x-ray |
Diffraction radiation wavelength | 1.34143 Å |
Diffraction radiation type | GaKα |