Information card for entry 1561074
Formula | C10 H11 N2 O2 S |
Calculated formula | C10 H11 N2 O2 S |
Title of publication | Role of S…O non-bonded interaction in controlling supramolecular assemblies in a new series of 2-aminobenzothiazole based organic salts/ co-crystals |
Authors of publication | Yadav, Priyanka; Patel, Vatsa; Ballabh, Amar |
Journal of publication | Journal of Solid State Chemistry |
Year of publication | 2018 |
Journal volume | 263 |
Pages of publication | 231 - 238 |
a | 11.38577 ± 0.00018 Å |
b | 5.56906 ± 0.00012 Å |
c | 17.5663 ± 0.0003 Å |
α | 90° |
β | 95.5051 ± 0.0015° |
γ | 90° |
Cell volume | 1108.71 ± 0.04 Å3 |
Cell temperature | 293 K |
Ambient diffraction temperature | 293 ± 2 K |
Number of distinct elements | 5 |
Space group number | 14 |
Hermann-Mauguin space group symbol | P 1 21/c 1 |
Hall space group symbol | -P 2ybc |
Residual factor for all reflections | 0.0381 |
Residual factor for significantly intense reflections | 0.0343 |
Weighted residual factors for significantly intense reflections | 0.0948 |
Weighted residual factors for all reflections included in the refinement | 0.0986 |
Goodness-of-fit parameter for all reflections included in the refinement | 1.068 |
Diffraction radiation probe | x-ray |
Diffraction radiation wavelength | 1.54184 Å |
Diffraction radiation type | CuKα |
Diffraction radiation X-ray symbol | Mo |