Information card for entry 1561096
Formula | C27 H29 B O |
Calculated formula | C27 H29 B O |
SMILES | O1B(c2c(C=C1c1ccc(cc1)C(C)(C)C)cccc2)c1c(cc(cc1C)C)C |
Title of publication | One tool to bring them all: Au-catalyzed synthesis of B,O- and B,N-doped PAHs from boronic and borinic acids |
Authors of publication | Ouadoudi, Omar; Kaehler, Tanja; Bolte, Michael; Lerner, Hans-Wolfram; Wagner, Matthias |
Journal of publication | Chemical Science |
Year of publication | 2021 |
Journal volume | 12 |
Journal issue | 16 |
Pages of publication | 5898 - 5909 |
a | 23.7421 ± 0.0008 Å |
b | 21.8444 ± 0.0006 Å |
c | 8.6139 ± 0.0002 Å |
α | 90° |
β | 90° |
γ | 90° |
Cell volume | 4467.4 ± 0.2 Å3 |
Cell temperature | 173 ± 2 K |
Ambient diffraction temperature | 173 ± 2 K |
Number of distinct elements | 4 |
Space group number | 61 |
Hermann-Mauguin space group symbol | P b c a |
Hall space group symbol | -P 2ac 2ab |
Residual factor for all reflections | 0.0551 |
Residual factor for significantly intense reflections | 0.0451 |
Weighted residual factors for significantly intense reflections | 0.1163 |
Weighted residual factors for all reflections included in the refinement | 0.1255 |
Goodness-of-fit parameter for all reflections included in the refinement | 1.077 |
Diffraction radiation wavelength | 0.71073 Å |
Diffraction radiation type | MoKα |