Information card for entry 1561187
Formula | C73 H162 K2 N2 O24 S2 Si6 U2 |
Calculated formula | C73 H162 K2 N2 O24 S2 Si6 U2 |
Title of publication | Single metal four-electron reduction by U(ii) and masked "U(ii)" compounds. |
Authors of publication | Modder, Dieuwertje K.; Palumbo, Chad T.; Douair, Iskander; Scopelliti, Rosario; Maron, Laurent; Mazzanti, Marinella |
Journal of publication | Chemical science |
Year of publication | 2021 |
Journal volume | 12 |
Journal issue | 17 |
Pages of publication | 6153 - 6158 |
a | 13.9065 ± 0.0004 Å |
b | 18.2338 ± 0.0007 Å |
c | 22.181 ± 0.0009 Å |
α | 90° |
β | 92.45 ± 0.004° |
γ | 90° |
Cell volume | 5619.3 ± 0.4 Å3 |
Cell temperature | 139.99 ± 0.1 K |
Ambient diffraction temperature | 139.99 ± 0.1 K |
Number of distinct elements | 8 |
Space group number | 4 |
Hermann-Mauguin space group symbol | P 1 21 1 |
Hall space group symbol | P 2yb |
Residual factor for all reflections | 0.1313 |
Residual factor for significantly intense reflections | 0.0772 |
Weighted residual factors for significantly intense reflections | 0.1898 |
Weighted residual factors for all reflections included in the refinement | 0.2164 |
Goodness-of-fit parameter for all reflections included in the refinement | 1.074 |
Diffraction radiation probe | x-ray |
Diffraction radiation wavelength | 1.54184 Å |
Diffraction radiation type | CuKα |