Information card for entry 1561226
Formula | C38 H94 Ba O5 Si6 Sn2 |
Calculated formula | C38 H94 Ba O5 Si6 Sn2 |
Title of publication | Metal‒metal bonded alkaline-earth distannyls |
Authors of publication | Chapple, Peter M.; Cartron, Julien; Hamdoun, Ghanem; Kahlal, Samia; Cordier, Marie; Oulyadi, Hassan; Carpentier, Jean-François; Saillard, Jean-Yves; Sarazin, Yann |
Journal of publication | Chemical Science |
Year of publication | 2021 |
Journal volume | 12 |
Journal issue | 20 |
Pages of publication | 7098 - 7114 |
a | 19.499 ± 0.004 Å |
b | 17.117 ± 0.003 Å |
c | 34.898 ± 0.007 Å |
α | 90° |
β | 91.768 ± 0.006° |
γ | 90° |
Cell volume | 11642 ± 4 Å3 |
Cell temperature | 150 K |
Ambient diffraction temperature | 150 K |
Number of distinct elements | 6 |
Space group number | 15 |
Hermann-Mauguin space group symbol | C 1 2/c 1 |
Hall space group symbol | -C 2yc |
Residual factor for all reflections | 0.0643 |
Residual factor for significantly intense reflections | 0.0569 |
Weighted residual factors for significantly intense reflections | 0.1231 |
Weighted residual factors for all reflections included in the refinement | 0.1267 |
Goodness-of-fit parameter for all reflections included in the refinement | 1.128 |
Diffraction radiation probe | x-ray |
Diffraction radiation wavelength | 0.71073 Å |
Diffraction radiation type | MoKα |