Information card for entry 1561249
Formula | C4 H16 Cl4 Co N2 |
Calculated formula | C4 H16 Cl4 Co N2 |
SMILES | [Co](Cl)(Cl)([Cl-])[Cl-].[NH3+]CC.[NH3+]CC |
Title of publication | Order-disorder structural phase transition and magnetocaloric effect in organic-inorganic halide hybrid (C2H5NH3)2CoCl4 |
Authors of publication | Sen, Abhijit; Roy, Soumyabrata; Peter, Sebastian C.; Paul, Arpita; Waghmare, Umesh V.; Sundaresan, A. |
Journal of publication | Journal of Solid State Chemistry |
Year of publication | 2018 |
Journal volume | 258 |
Pages of publication | 431 - 440 |
a | 7.6216 ± 0.0012 Å |
b | 9.6734 ± 0.0015 Å |
c | 16.831 ± 0.003 Å |
α | 90° |
β | 90° |
γ | 90° |
Cell volume | 1240.9 ± 0.4 Å3 |
Cell temperature | 100 K |
Ambient diffraction temperature | 100 K |
Number of distinct elements | 5 |
Space group number | 19 |
Hermann-Mauguin space group symbol | P 21 21 21 |
Hall space group symbol | P 2ac 2ab |
Residual factor for all reflections | 0.0494 |
Residual factor for significantly intense reflections | 0.0415 |
Weighted residual factors for significantly intense reflections | 0.0894 |
Weighted residual factors for all reflections included in the refinement | 0.0922 |
Goodness-of-fit parameter for all reflections included in the refinement | 1.141 |
Diffraction radiation wavelength | 0.71073 Å |
Diffraction radiation type | MoKα |