Information card for entry 1561285
Formula | C18 H21 Co2 N4 O14 S |
Calculated formula | C18 H21 Co2 N4 O14 S |
Title of publication | 2-(hydroxymethyl)-1H-benzo[d]imidazole-5-carboxylic acid as linker for Co(II)/Ni(II)/Cu(II) coordination polymers: Synthesis, structures and properties |
Authors of publication | Wang, Duo-Zhi; Wang, Xin-Fang; Du, Jia-Qiang; Dong, Jun-Liang; Xie, Fei |
Journal of publication | Journal of Solid State Chemistry |
Year of publication | 2018 |
Journal volume | 258 |
Pages of publication | 728 - 736 |
a | 7.622 ± 0.002 Å |
b | 11.109 ± 0.003 Å |
c | 27.938 ± 0.007 Å |
α | 90° |
β | 95.286 ± 0.006° |
γ | 90° |
Cell volume | 2355.5 ± 1.1 Å3 |
Cell temperature | 296 ± 2 K |
Ambient diffraction temperature | 296 ± 2 K |
Number of distinct elements | 6 |
Space group number | 14 |
Hermann-Mauguin space group symbol | P 1 21/c 1 |
Hall space group symbol | -P 2ybc |
Residual factor for all reflections | 0.0879 |
Residual factor for significantly intense reflections | 0.0776 |
Weighted residual factors for significantly intense reflections | 0.2072 |
Weighted residual factors for all reflections included in the refinement | 0.2129 |
Goodness-of-fit parameter for all reflections included in the refinement | 1.048 |
Diffraction radiation wavelength | 0.71073 Å |
Diffraction radiation type | MoKα |