Information card for entry 1561294
Formula | C8 H21 N O4 S |
Calculated formula | C8 H21 N O4 S |
SMILES | S(=O)(=O)(O)[O-].C([NH2+]CC(C)C)C(C)C |
Title of publication | Structure, dielectric and electric properties of diisobutylammonium hydrogen sulfate crystal |
Authors of publication | Bednarchuk, Tamara J.; Kinzhybalo, Vasyl; Markiewicz, Ewa; Hilczer, Bożena; Pietraszko, Adam |
Journal of publication | Journal of Solid State Chemistry |
Year of publication | 2018 |
Journal volume | 258 |
Pages of publication | 753 - 761 |
a | 10.12 ± 0.04 Å |
b | 16.178 ± 0.005 Å |
c | 8.476 ± 0.003 Å |
α | 90° |
β | 110.08 ± 0.03° |
γ | 90° |
Cell volume | 1303 ± 5 Å3 |
Cell temperature | 330.01 ± 0.11 K |
Ambient diffraction temperature | 330.01 ± 0.11 K |
Number of distinct elements | 5 |
Space group number | 14 |
Hermann-Mauguin space group symbol | P 1 21/c 1 |
Hall space group symbol | -P 2ybc |
Residual factor for all reflections | 0.2487 |
Residual factor for significantly intense reflections | 0.068 |
Weighted residual factors for significantly intense reflections | 0.1723 |
Weighted residual factors for all reflections included in the refinement | 0.2078 |
Goodness-of-fit parameter for all reflections included in the refinement | 0.718 |
Diffraction radiation probe | x-ray |
Diffraction radiation wavelength | 0.71073 Å |
Diffraction radiation type | MoKα |