Information card for entry 1561589
Formula | Cs5 O62 P2 W18 |
Calculated formula | Cs5.003 O62 P2 W18 |
Title of publication | Integrating molecular design and crystal engineering approaches in non-humidified intermediate-temperature proton conductors based on a Dawson-type polyoxometalate and poly(ethylene glycol) derivatives. |
Authors of publication | Ogiwara, Naoki; Tomoda, Masahiro; Miyazaki, Shotaro; Weng, Zhewei; Takatsu, Hiroshi; Kageyama, Hiroshi; Misawa, Toshiyuki; Ito, Takeru; Uchida, Sayaka |
Journal of publication | Nanoscale |
Year of publication | 2021 |
Journal volume | 13 |
Journal issue | 17 |
Pages of publication | 8049 - 8057 |
a | 24.1713 ± 0.0015 Å |
b | 16.5887 ± 0.0009 Å |
c | 12.6541 ± 0.0006 Å |
α | 90° |
β | 90° |
γ | 90° |
Cell volume | 5073.9 ± 0.5 Å3 |
Cell temperature | 153.15 K |
Ambient diffraction temperature | 153.15 K |
Number of distinct elements | 4 |
Space group number | 59 |
Hermann-Mauguin space group symbol | P m m n :2 |
Hall space group symbol | -P 2ab 2a |
Residual factor for all reflections | 0.1326 |
Residual factor for significantly intense reflections | 0.0969 |
Weighted residual factors for significantly intense reflections | 0.2643 |
Weighted residual factors for all reflections included in the refinement | 0.2956 |
Goodness-of-fit parameter for all reflections included in the refinement | 1.049 |
Diffraction radiation probe | x-ray |
Diffraction radiation wavelength | 0.71073 Å |
Diffraction radiation type | MoKα |