Information card for entry 1561757
Common name | diiron heptaboride |
Chemical name | diiron heptaboride |
Formula | B7 Fe2 |
Calculated formula | B7 Fe2 |
Title of publication | Crystal structures and compressibility of novel iron borides Fe2B7 and Fe B50 synthesized at high pressure and high temperature |
Authors of publication | Bykova, E.; Gou, H.; Bykov, M.; Hanfland, M.; Dubrovinsky, L.; Dubrovinskaia, N. |
Journal of publication | Journal of Solid State Chemistry |
Year of publication | 2015 |
Journal volume | 230 |
Pages of publication | 102 - 109 |
a | 16.846 ± 0.0008 Å |
b | 10.6107 ± 0.0001 Å |
c | 2.8751 ± 0.0001 Å |
α | 90° |
β | 90° |
γ | 90° |
Cell volume | 513.92 ± 0.03 Å3 |
Cell temperature | 293 K |
Ambient diffraction temperature | 293 K |
Ambient diffracton pressure | 5650000 kPa |
Number of distinct elements | 2 |
Space group number | 55 |
Hermann-Mauguin space group symbol | P b a m |
Hall space group symbol | -P 2 2ab |
Residual factor for all reflections | 0.0347 |
Residual factor for significantly intense reflections | 0.0295 |
Weighted residual factors for significantly intense reflections | 0.0741 |
Weighted residual factors for all reflections included in the refinement | 0.0827 |
Goodness-of-fit parameter for significantly intense reflections | 1.48 |
Goodness-of-fit parameter for all reflections included in the refinement | 1.53 |
Diffraction radiation probe | x-ray |
Diffraction radiation wavelength | 0.41441 Å |
Diffraction radiation type | synchrotron |