Information card for entry 1562118
Formula | C28.69 H47.76 N5 O4.94 Si2 |
Calculated formula | C28.6913 H47.7653 N5 O4.94133 Si2 |
Title of publication | Anion mediated, tunable isoguanosine self-assemblies: decoding the conformation influence and solvent effects. |
Authors of publication | Liu, Mengjia; He, Ying; Shan, Chuan; Wojtas, Lukasz; Ghiviriga, Ion; Fathalla, Omar; Yan, Yu; Li, Xiaopeng; Shi, Xiaodong |
Journal of publication | Chemical science |
Year of publication | 2021 |
Journal volume | 12 |
Journal issue | 21 |
Pages of publication | 7569 - 7574 |
a | 64.413 ± 0.002 Å |
b | 7.1861 ± 0.0002 Å |
c | 22.2867 ± 0.0007 Å |
α | 90° |
β | 99.221 ± 0.001° |
γ | 90° |
Cell volume | 10182.7 ± 0.5 Å3 |
Cell temperature | 115 ± 2 K |
Ambient diffraction temperature | 115 ± 2 K |
Number of distinct elements | 5 |
Space group number | 5 |
Hermann-Mauguin space group symbol | C 1 2 1 |
Hall space group symbol | C 2y |
Residual factor for all reflections | 0.0746 |
Residual factor for significantly intense reflections | 0.0646 |
Weighted residual factors for significantly intense reflections | 0.1792 |
Weighted residual factors for all reflections included in the refinement | 0.1909 |
Goodness-of-fit parameter for all reflections included in the refinement | 1.024 |
Diffraction radiation wavelength | 1.54178 Å |
Diffraction radiation type | CuKα |