Information card for entry 1562132
Common name | Gallium(7)Germanium(3)Tellurium(11) |
Formula | Ga7 Ge3 Te11 |
Calculated formula | Ga7 Ge3 Te11 |
Title of publication | Synthesis of new Ga7Ge3Te11—One-dimensional phase in Ga‒Ge‒Te ternary system: Crystal structure and physical properties |
Authors of publication | Drasar, Cestmir; Cisarova, Ivana; Kucek, Vladimir; Benes, Ludvik; Prokleska, Jan; Kratochvilova, Marie |
Journal of publication | Journal of Solid State Chemistry |
Year of publication | 2015 |
Journal volume | 222 |
Pages of publication | 90 - 95 |
a | 38.903 ± 0.006 Å |
b | 4.0877 ± 0.0007 Å |
c | 15.37 ± 0.003 Å |
α | 90° |
β | 90° |
γ | 90° |
Cell volume | 2444.2 ± 0.7 Å3 |
Cell temperature | 150 ± 2 K |
Ambient diffraction temperature | 150 ± 2 K |
Number of distinct elements | 3 |
Space group number | 62 |
Hermann-Mauguin space group symbol | P n m a |
Hall space group symbol | -P 2ac 2n |
Residual factor for all reflections | 0.0964 |
Residual factor for significantly intense reflections | 0.0449 |
Weighted residual factors for significantly intense reflections | 0.0815 |
Weighted residual factors for all reflections included in the refinement | 0.0961 |
Goodness-of-fit parameter for all reflections included in the refinement | 0.981 |
Diffraction radiation wavelength | 0.71073 Å |
Diffraction radiation type | MoKα |