Information card for entry 1562676
Formula | C6 H12 Br3 N2 Pb |
Calculated formula | C6 H12 Br3 N2 Pb |
Title of publication | Systematic Approach of One-Dimensional Lead Perovskites with Face-Sharing Connectivity to Realize Efficient and Tunable Broadband Light Emission |
Authors of publication | Zhao, Jian-Qiang; Jing, Chang-Qing; Wu, Jia-Hang; Zhang, Wei-Feng; Feng, Li-Juan; Yue, Cheng-Yang; Lei, Xiao-Wu |
Journal of publication | The Journal of Physical Chemistry C |
Year of publication | 2021 |
Journal volume | 125 |
Journal issue | 20 |
Pages of publication | 10850 - 10859 |
a | 7.941 ± 0.002 Å |
b | 9.783 ± 0.003 Å |
c | 16.168 ± 0.005 Å |
α | 90° |
β | 90° |
γ | 90° |
Cell volume | 1256 ± 0.6 Å3 |
Cell temperature | 296 ± 2 K |
Ambient diffraction temperature | 296.15 K |
Number of distinct elements | 5 |
Space group number | 62 |
Hermann-Mauguin space group symbol | P n m a |
Hall space group symbol | -P 2ac 2n |
Residual factor for all reflections | 0.0319 |
Residual factor for significantly intense reflections | 0.0254 |
Weighted residual factors for significantly intense reflections | 0.0551 |
Weighted residual factors for all reflections included in the refinement | 0.0576 |
Goodness-of-fit parameter for all reflections included in the refinement | 1.076 |
Diffraction radiation wavelength | 0.71073 Å |
Diffraction radiation type | MoKα |