Information card for entry 1563839
Formula | C29 H26 Cd N4 O5 S |
Calculated formula | C29 H24 Cd N4 O5 S |
Title of publication | Construction of Cd(II) coordination polymers from a fluorene-based bisimidazole ligand and polycarboxylic acids: syntheses, structures and properties |
Authors of publication | Sun, Shaowen; Sun, Yingying; Guo, Huadong; Fu, Xirao; Guo, Mingming; Liu, Siyu; Guo, Xianmin; Zhang, Liang; Alexandrov, Eugeny V. |
Journal of publication | Inorganica Chimica Acta |
Year of publication | 2018 |
Journal volume | 483 |
Pages of publication | 165 - 172 |
a | 12.1565 ± 0.0006 Å |
b | 11.5144 ± 0.0005 Å |
c | 20.0637 ± 0.0009 Å |
α | 90° |
β | 100.2 ± 0.001° |
γ | 90° |
Cell volume | 2764 ± 0.2 Å3 |
Cell temperature | 293 ± 2 K |
Ambient diffraction temperature | 293 ± 2 K |
Number of distinct elements | 6 |
Space group number | 14 |
Hermann-Mauguin space group symbol | P 1 21/c 1 |
Hall space group symbol | -P 2ybc |
Residual factor for all reflections | 0.0293 |
Residual factor for significantly intense reflections | 0.0221 |
Weighted residual factors for significantly intense reflections | 0.0617 |
Weighted residual factors for all reflections included in the refinement | 0.0792 |
Goodness-of-fit parameter for all reflections included in the refinement | 1.23 |
Diffraction radiation wavelength | 0.71073 Å |
Diffraction radiation type | MoKα |