Information card for entry 1564609
Formula | C54 H44 Ag N4 O4 |
Calculated formula | C54 H44 Ag N4 O4 |
Title of publication | Coordination-directed self-assembly of molecular motors: towards a two-wheel drive nanocar. |
Authors of publication | Li, Menglian; Li, Shaorui; Zhang, Kexin; Chi, Xin; Zhou, Hang; Xu, Hai-Bing; Zhang, Yuexing; Li, Quan; Wang, Dong; Zeng, Ming-Hua |
Journal of publication | Nanoscale |
Year of publication | 2021 |
Journal volume | 13 |
Journal issue | 39 |
Pages of publication | 16748 - 16754 |
a | 38.163 ± 0.0011 Å |
b | 17.6194 ± 0.0007 Å |
c | 7.3988 ± 0.0003 Å |
α | 90° |
β | 92.801 ± 0.003° |
γ | 90° |
Cell volume | 4969.1 ± 0.3 Å3 |
Cell temperature | 293 ± 2 K |
Ambient diffraction temperature | 293 ± 2 K |
Number of distinct elements | 5 |
Space group number | 15 |
Hermann-Mauguin space group symbol | C 1 2/c 1 |
Hall space group symbol | -C 2yc |
Residual factor for all reflections | 0.0551 |
Residual factor for significantly intense reflections | 0.0421 |
Weighted residual factors for significantly intense reflections | 0.1052 |
Weighted residual factors for all reflections included in the refinement | 0.1122 |
Goodness-of-fit parameter for all reflections included in the refinement | 1.047 |
Diffraction radiation wavelength | 1.54184 Å |
Diffraction radiation type | CuKα |