Information card for entry 1564867
Formula |
C9 H21 Mo N3 O2 S |
Calculated formula |
C9 H21 Mo N3 O2 S |
Title of publication |
Syntheses, characterizations, and reactivities of new 1,4,7-trimethyl-l,4,7-triazacyclononane (Me3tacn) molybdenum and tungsten complexes |
Authors of publication |
Zhang, Cai-Xia; Fang, Duo-Wen; Wang, Jun-Ling; Jia, Ai-Quan; Zhang, Qian-Feng |
Journal of publication |
Inorganica Chimica Acta |
Year of publication |
2020 |
Journal volume |
507 |
Pages of publication |
119599 |
a |
12.066 ± 0.003 Å |
b |
10.388 ± 0.003 Å |
c |
10.613 ± 0.003 Å |
α |
90° |
β |
90° |
γ |
90° |
Cell volume |
1330.3 ± 0.6 Å3 |
Cell temperature |
296 ± 2 K |
Ambient diffraction temperature |
296 ± 2 K |
Number of distinct elements |
6 |
Space group number |
39 |
Hermann-Mauguin space group symbol |
A e m 2 |
Hall space group symbol |
A 2 -2b |
Residual factor for all reflections |
0.022 |
Residual factor for significantly intense reflections |
0.0217 |
Weighted residual factors for significantly intense reflections |
0.0541 |
Weighted residual factors for all reflections included in the refinement |
0.0544 |
Goodness-of-fit parameter for all reflections included in the refinement |
1.102 |
Diffraction radiation wavelength |
0.71073 Å |
Diffraction radiation type |
MoKα |
Yes |
No |
No |