Information card for entry 1565077
Chemical name | tetrakis(4-dihydroxyborylphenyl)adamantane dimethyl sulfoxide pentasolvate |
Formula | C44 H60 B4 O13 S5 |
Calculated formula | C44 H60 B4 O13 S5 |
Title of publication | Design of solvatomorphic structures based on a polyboronated tetraphenyladamantane molecular tecton |
Authors of publication | Drapała, Jakub; Marek-Urban, Paulina H.; Klimkowski, Piotr; Urbanowicz, Karolina A.; Gontarczyk, Krzysztof; Woźniak, Krzysztof; Luliński, Sergiusz; Durka, Krzysztof |
Journal of publication | CrystEngComm |
Year of publication | 2021 |
Journal volume | 23 |
Journal issue | 46 |
Pages of publication | 8169 - 8182 |
a | 18.8442 ± 0.0015 Å |
b | 18.8442 ± 0.0015 Å |
c | 7.0478 ± 0.0006 Å |
α | 90° |
β | 90° |
γ | 90° |
Cell volume | 2502.7 ± 0.4 Å3 |
Cell temperature | 100 ± 2 K |
Ambient diffraction temperature | 100 ± 0.1 K |
Number of distinct elements | 5 |
Space group number | 85 |
Hermann-Mauguin space group symbol | P 4/n :2 |
Hall space group symbol | -P 4a |
Residual factor for all reflections | 0.1317 |
Residual factor for significantly intense reflections | 0.1168 |
Weighted residual factors for significantly intense reflections | 0.2442 |
Weighted residual factors for all reflections included in the refinement | 0.2522 |
Goodness-of-fit parameter for all reflections included in the refinement | 1.205 |
Diffraction radiation probe | x-ray |
Diffraction radiation wavelength | 1.54184 Å |
Diffraction radiation type | CuKα |