Information card for entry 1565080
Chemical name | tetrakis(4-dihydroxyborylphenyl)adamantane acetonitrile monosolvate dimethyl sulfoxide tetrasolvate |
Formula | C43 H61.5 B4 N0.5 O12 S4 |
Calculated formula | C43 H61.5 B4 N0.5 O12 S4 |
Title of publication | Design of solvatomorphic structures based on a polyboronated tetraphenyladamantane molecular tecton |
Authors of publication | Drapała, Jakub; Marek-Urban, Paulina H.; Klimkowski, Piotr; Urbanowicz, Karolina A.; Gontarczyk, Krzysztof; Woźniak, Krzysztof; Luliński, Sergiusz; Durka, Krzysztof |
Journal of publication | CrystEngComm |
Year of publication | 2021 |
Journal volume | 23 |
Journal issue | 46 |
Pages of publication | 8169 - 8182 |
a | 18.7776 ± 0.0003 Å |
b | 18.7776 ± 0.0003 Å |
c | 7.0172 ± 0.0003 Å |
α | 90° |
β | 90° |
γ | 90° |
Cell volume | 2474.25 ± 0.12 Å3 |
Cell temperature | 100 ± 2 K |
Ambient diffraction temperature | 95 ± 2 K |
Number of distinct elements | 6 |
Space group number | 85 |
Hermann-Mauguin space group symbol | P 4/n :2 |
Hall space group symbol | -P 4a |
Residual factor for all reflections | 0.1126 |
Residual factor for significantly intense reflections | 0.0825 |
Weighted residual factors for significantly intense reflections | 0.2422 |
Weighted residual factors for all reflections included in the refinement | 0.2699 |
Goodness-of-fit parameter for all reflections included in the refinement | 1.055 |
Diffraction radiation wavelength | 1.54178 Å |
Diffraction radiation type | CuKα |