Information card for entry 1567184
Formula | C22 H56 Al O P Si4 |
Calculated formula | C22 H56 Al O P Si4 |
Title of publication | Carbon dioxide reduction by an Al-O-P frustrated Lewis pair. |
Authors of publication | Wickemeyer, Lucas; Aders, Niklas; Mix, Andreas; Neumann, Beate; Stammler, Hans-Georg; Cabrera-Trujillo, Jorge J; Fernández, Israel; Mitzel, Norbert W. |
Journal of publication | Chemical science |
Year of publication | 2022 |
Journal volume | 13 |
Journal issue | 27 |
Pages of publication | 8088 - 8094 |
a | 9.05033 ± 0.00013 Å |
b | 11.72687 ± 0.00018 Å |
c | 16.30904 ± 0.00019 Å |
α | 94.4336 ± 0.0011° |
β | 96.4467 ± 0.0011° |
γ | 108.884 ± 0.0014° |
Cell volume | 1615.45 ± 0.04 Å3 |
Cell temperature | 100 ± 0.1 K |
Ambient diffraction temperature | 100 ± 0.1 K |
Number of distinct elements | 6 |
Space group number | 2 |
Hermann-Mauguin space group symbol | P -1 |
Hall space group symbol | -P 1 |
Residual factor for all reflections | 0.0329 |
Residual factor for significantly intense reflections | 0.032 |
Weighted residual factors for significantly intense reflections | 0.0786 |
Weighted residual factors for all reflections included in the refinement | 0.0793 |
Goodness-of-fit parameter for all reflections included in the refinement | 1.023 |
Diffraction radiation probe | x-ray |
Diffraction radiation wavelength | 1.54184 Å |
Diffraction radiation type | CuKα |