Information card for entry 1567289
Formula | C36 H46 B2 Cu F8 N10 O4 |
Calculated formula | C36 H46 B2 Cu F8 N10 O4 |
Title of publication | Manipulating electron transfer – the influence of substituents on novel copper guanidine quinolinyl complexes |
Authors of publication | Heck, Joshua; Metz, Fabian; Buchenau, Sören; Teubner, Melissa; Grimm-Lebsanft, Benjamin; Spaniol, Thomas P.; Hoffmann, Alexander; Rübhausen, Michael A.; Herres-Pawlis, Sonja |
Journal of publication | Chemical Science |
Year of publication | 2022 |
Journal volume | 13 |
Journal issue | 28 |
Pages of publication | 8274 - 8288 |
a | 13.585 ± 0.003 Å |
b | 25.27 ± 0.005 Å |
c | 12.065 ± 0.002 Å |
α | 90° |
β | 91.75 ± 0.03° |
γ | 90° |
Cell volume | 4139.9 ± 1.4 Å3 |
Cell temperature | 100 ± 2 K |
Ambient diffraction temperature | 100 ± 2 K |
Number of distinct elements | 7 |
Space group number | 14 |
Hermann-Mauguin space group symbol | P 1 21/c 1 |
Hall space group symbol | -P 2ybc |
Residual factor for all reflections | 0.073 |
Residual factor for significantly intense reflections | 0.0474 |
Weighted residual factors for significantly intense reflections | 0.1099 |
Weighted residual factors for all reflections included in the refinement | 0.1211 |
Goodness-of-fit parameter for all reflections included in the refinement | 1.026 |
Diffraction radiation wavelength | 0.71073 Å |
Diffraction radiation type | MoKα |