Information card for entry 1567431
Formula | C8 H13 N S Si |
Calculated formula | C8 H13 N S Si |
Title of publication | Molecular Structures of the Silicon Pyridine-2-(thi)olates Me3Si(pyX), Me2Si(pyX)2 and Ph2Si(pyX)2 (py = 2-Pyridyl, X = O, S), and Their Intra- and Intermolecular Ligand Exchange in Solution |
Authors of publication | Seidel, Anne; Weigel, Mareike; Ehrlich, Lisa; Gericke, Robert; Brendler, Erica; Wagler, Jörg |
Journal of publication | Crystals |
Year of publication | 2022 |
Journal volume | 12 |
Journal issue | 8 |
Pages of publication | 1054 |
a | 6.6079 ± 0.0007 Å |
b | 7.2078 ± 0.0006 Å |
c | 11.1025 ± 0.0012 Å |
α | 90° |
β | 97.954 ± 0.009° |
γ | 90° |
Cell volume | 523.71 ± 0.09 Å3 |
Cell temperature | 220 ± 2 K |
Ambient diffraction temperature | 220 ± 2 K |
Number of distinct elements | 5 |
Space group number | 11 |
Hermann-Mauguin space group symbol | P 1 21/m 1 |
Hall space group symbol | -P 2yb |
Residual factor for all reflections | 0.0354 |
Residual factor for significantly intense reflections | 0.033 |
Weighted residual factors for significantly intense reflections | 0.0914 |
Weighted residual factors for all reflections included in the refinement | 0.0948 |
Goodness-of-fit parameter for all reflections included in the refinement | 1.106 |
Diffraction radiation wavelength | 0.71073 Å |
Diffraction radiation type | MoKα |