Information card for entry 1567438
Formula | C29 H26 N2 S2 Si |
Calculated formula | C25.5 H22 N2 S2 Si |
Title of publication | Molecular Structures of the Silicon Pyridine-2-(thi)olates Me3Si(pyX), Me2Si(pyX)2 and Ph2Si(pyX)2 (py = 2-Pyridyl, X = O, S), and Their Intra- and Intermolecular Ligand Exchange in Solution |
Authors of publication | Seidel, Anne; Weigel, Mareike; Ehrlich, Lisa; Gericke, Robert; Brendler, Erica; Wagler, Jörg |
Journal of publication | Crystals |
Year of publication | 2022 |
Journal volume | 12 |
Journal issue | 8 |
Pages of publication | 1054 |
a | 9.7034 ± 0.0009 Å |
b | 11.2023 ± 0.0009 Å |
c | 13.2853 ± 0.0013 Å |
α | 73.607 ± 0.007° |
β | 72.232 ± 0.007° |
γ | 82.511 ± 0.007° |
Cell volume | 1317.8 ± 0.2 Å3 |
Cell temperature | 200 ± 2 K |
Ambient diffraction temperature | 200 ± 2 K |
Number of distinct elements | 5 |
Space group number | 2 |
Hermann-Mauguin space group symbol | P -1 |
Hall space group symbol | -P 1 |
Residual factor for all reflections | 0.0563 |
Residual factor for significantly intense reflections | 0.0365 |
Weighted residual factors for significantly intense reflections | 0.0861 |
Weighted residual factors for all reflections included in the refinement | 0.0929 |
Goodness-of-fit parameter for all reflections included in the refinement | 1.043 |
Diffraction radiation wavelength | 0.71073 Å |
Diffraction radiation type | MoKα |