Information card for entry 1567585
Formula | C68 H48 Co N10 S2 |
Calculated formula | C68 H48 Co N10 S2 |
Title of publication | To Be or Not to Be a (4,4) Net: Reactions of 4′-{4-(N,N-Diethylaminophenyl)}- and 4′-{4-(N,N-Diphenylaminophenyl)}-3,2′:6′,3″- and 4,2′:6′,4″-Terpyridines with Cobalt(II) Thiocyanate |
Authors of publication | Rocco, Dalila; Nikoletić, Anamarija; Prescimone, Alessandro; Constable, Edwin C.; Housecroft, Catherine E. |
Journal of publication | Crystals |
Year of publication | 2022 |
Journal volume | 12 |
Journal issue | 8 |
Pages of publication | 1136 |
a | 8.7148 ± 0.0003 Å |
b | 18.4121 ± 0.0006 Å |
c | 18.2547 ± 0.0005 Å |
α | 90° |
β | 101.524 ± 0.002° |
γ | 90° |
Cell volume | 2870.06 ± 0.16 Å3 |
Cell temperature | 150 K |
Ambient diffraction temperature | 150 K |
Number of distinct elements | 5 |
Space group number | 14 |
Hermann-Mauguin space group symbol | P 1 21/c 1 |
Hall space group symbol | -P 2ybc |
Residual factor for all reflections | 0.1614 |
Residual factor for significantly intense reflections | 0.1458 |
Weighted residual factors for significantly intense reflections | 0.3652 |
Weighted residual factors for all reflections included in the refinement | 0.3729 |
Goodness-of-fit parameter for all reflections included in the refinement | 0.977 |
Diffraction radiation probe | x-ray |
Diffraction radiation wavelength | 1.54186 Å |
Diffraction radiation type | CuKα |