Information card for entry 1567610
Formula | C22 H14 I3 N |
Calculated formula | C22 H14 I3 N |
Title of publication | Pushing the limits of the hydrogen bond enhanced halogen bond—the case of the C–H hydrogen bond |
Authors of publication | Decato, Daniel A.; Sun, Jiyu; Boller, Madeleine R.; Berryman, Orion B. |
Journal of publication | Chemical Science |
Year of publication | 2022 |
Journal volume | 13 |
Journal issue | 37 |
Pages of publication | 11156 - 11162 |
a | 8.0838 ± 0.0002 Å |
b | 11.8898 ± 0.0004 Å |
c | 12.2871 ± 0.0004 Å |
α | 64.355 ± 0.001° |
β | 77.901 ± 0.001° |
γ | 77.39 ± 0.001° |
Cell volume | 1030.02 ± 0.06 Å3 |
Cell temperature | 100 K |
Ambient diffraction temperature | 100 K |
Number of distinct elements | 4 |
Space group number | 2 |
Hermann-Mauguin space group symbol | P -1 |
Hall space group symbol | -P 1 |
Residual factor for all reflections | 0.0218 |
Residual factor for significantly intense reflections | 0.0171 |
Weighted residual factors for significantly intense reflections | 0.0352 |
Weighted residual factors for all reflections included in the refinement | 0.0362 |
Goodness-of-fit parameter for all reflections included in the refinement | 1.097 |
Diffraction radiation probe | x-ray |
Diffraction radiation wavelength | 0.71073 Å |
Diffraction radiation type | MoKα |