Information card for entry 1568645
Formula | C53 H59 I N2 O P3 Rh |
Calculated formula | C53 H59 I N2 O P3 Rh |
Title of publication | Probing the donor strength of yldiide ligands: synthesis, structure and reactivity of rhodium complexes with a PC<sub>ylide</sub>N pincer ligand. |
Authors of publication | Lapointe, Sébastien; Duari, Prakash; Gessner, Viktoria H. |
Journal of publication | Chemical science |
Year of publication | 2023 |
Journal volume | 14 |
Journal issue | 14 |
Pages of publication | 3816 - 3825 |
a | 11.5146 ± 0.0002 Å |
b | 13.8208 ± 0.0002 Å |
c | 16.3726 ± 0.0003 Å |
α | 76.35 ± 0.001° |
β | 86.705 ± 0.001° |
γ | 79.973 ± 0.001° |
Cell volume | 2492.92 ± 0.07 Å3 |
Cell temperature | 100 ± 2 K |
Ambient diffraction temperature | 100 ± 2 K |
Number of distinct elements | 7 |
Space group number | 2 |
Hermann-Mauguin space group symbol | P -1 |
Hall space group symbol | -P 1 |
Residual factor for all reflections | 0.0254 |
Residual factor for significantly intense reflections | 0.0235 |
Weighted residual factors for significantly intense reflections | 0.0606 |
Weighted residual factors for all reflections included in the refinement | 0.0615 |
Goodness-of-fit parameter for all reflections included in the refinement | 1.089 |
Diffraction radiation wavelength | 1.54184 Å |
Diffraction radiation type | CuKα |