Information card for entry 1568691
Chemical name | C30H30Cl6GdTi3 |
Formula | C30 H30 Cl6 Gd Ti3 |
Calculated formula | C30 H30 Cl6 Gd Ti3 |
Title of publication | Tuning symmetry and magnetic blocking of an exchange-coupled lanthanide ion in isomeric, tetrametallic complexes: [LnCl<sub>6</sub>(TiCp<sub>2</sub>)<sub>3</sub>]. |
Authors of publication | Jiang, Ningxin; Nakritskaia, Daria D.; Xie, Jiaze; Ramanathan, Arun; Varganov, Sergey A.; La Pierre, Henry S. |
Journal of publication | Chemical science |
Year of publication | 2023 |
Journal volume | 14 |
Journal issue | 16 |
Pages of publication | 4302 - 4307 |
a | 12.8073 ± 0.0011 Å |
b | 12.8073 ± 0.0011 Å |
c | 11.5663 ± 0.0014 Å |
α | 90° |
β | 90° |
γ | 120° |
Cell volume | 1643 ± 0.3 Å3 |
Cell temperature | 300 K |
Ambient diffraction temperature | 300 K |
Number of distinct elements | 5 |
Space group number | 176 |
Hermann-Mauguin space group symbol | P 63/m |
Hall space group symbol | -P 6c |
Residual factor for all reflections | 0.0425 |
Residual factor for significantly intense reflections | 0.0356 |
Weighted residual factors for significantly intense reflections | 0.0827 |
Weighted residual factors for all reflections included in the refinement | 0.0889 |
Goodness-of-fit parameter for all reflections included in the refinement | 1.14 |
Diffraction radiation probe | x-ray |
Diffraction radiation wavelength | 0.71073 Å |
Diffraction radiation type | MoKα |