Information card for entry 1569583
Formula | C129 H93 Ag13 Au4 Cl18 P6 S9 |
Calculated formula | C129 H93 Ag13 Au4 Cl18 P6 S9 |
Title of publication | Restriction of intramolecular rotation for functionalizing metal nanoclusters. |
Authors of publication | Xin, Junsheng; Xu, Jing; Zhu, Chen; Tian, Yupeng; Zhang, Qiong; Kang, Xi; Zhu, Manzhou |
Journal of publication | Chemical science |
Year of publication | 2023 |
Journal volume | 14 |
Journal issue | 32 |
Pages of publication | 8474 - 8482 |
a | 24.1353 ± 0.0004 Å |
b | 24.3999 ± 0.0004 Å |
c | 26.5043 ± 0.0004 Å |
α | 90° |
β | 90.951 ± 0.001° |
γ | 90° |
Cell volume | 15606.2 ± 0.4 Å3 |
Cell temperature | 120 K |
Ambient diffraction temperature | 120 K |
Number of distinct elements | 7 |
Space group number | 14 |
Hermann-Mauguin space group symbol | P 1 21/n 1 |
Hall space group symbol | -P 2yn |
Residual factor for all reflections | 0.0632 |
Residual factor for significantly intense reflections | 0.0443 |
Weighted residual factors for significantly intense reflections | 0.1028 |
Weighted residual factors for all reflections included in the refinement | 0.1078 |
Goodness-of-fit parameter for all reflections included in the refinement | 0.924 |
Diffraction radiation probe | x-ray |
Diffraction radiation wavelength | 1.54186 Å |
Diffraction radiation type | CuKα |