Information card for entry 1569657
Chemical name | HNBI-B |
Formula | C29 H21 B N2 O |
Calculated formula | C29 H21 B N2 O |
Title of publication | Luminescent hexagonal microtubes prepared through water-induced self-assembly of a polymorphic organoboron compound: formation mechanism and waveguide behaviour. |
Authors of publication | Gaikwad, Pradip A.; Samadder, Prodipta; Som, Shubham; Chopra, Deepak; Neelakandan, Prakash P.; Srivastava, Aasheesh |
Journal of publication | Nanoscale |
Year of publication | 2023 |
Journal volume | 15 |
Journal issue | 35 |
Pages of publication | 14380 - 14387 |
a | 11.7055 ± 0.0002 Å |
b | 11.9927 ± 0.0002 Å |
c | 16.2739 ± 0.0003 Å |
α | 73.063 ± 0.001° |
β | 74.387 ± 0.001° |
γ | 88.94 ± 0.001° |
Cell volume | 2100.35 ± 0.07 Å3 |
Cell temperature | 296 ± 2 K |
Ambient diffraction temperature | 296.15 K |
Number of distinct elements | 5 |
Space group number | 2 |
Hermann-Mauguin space group symbol | P -1 |
Hall space group symbol | -P 1 |
Residual factor for all reflections | 0.0827 |
Residual factor for significantly intense reflections | 0.0554 |
Weighted residual factors for significantly intense reflections | 0.1288 |
Weighted residual factors for all reflections included in the refinement | 0.1416 |
Goodness-of-fit parameter for all reflections included in the refinement | 1.073 |
Diffraction radiation wavelength | 0.71073 Å |
Diffraction radiation type | MoKα |